{"text_format":"1","workbook":"xlsx","n_sheets":15,"sheets":["INICIO","Instrucciones","Ingreso_de_datos","ParaGraficos","Resultados","Registro","Parametros","Actualización de parámetros","Movilidad","Recursos","MatRod","Mantenimiento","Infraestructura","Renovacion","Mejoramiento"],"not_rendered":{"charts":9,"images":10,"macros":1,"external_links":1,"defined_names":54,"comments":2,"pivot_tables":0},"unopened":[],"bounds":{"document_bytes":16777216,"sheet_cells":100000,"rows_first":2000,"rows_last":500,"rows_between":2000,"halvings":0,"cell_chars":16384,"cell_head_chars":4096},"cells_cut":0,"cells_raw":0,"read":"whole","date_system":"1900"}

{"sheet":"INICIO","index":0,"n_rows":27,"n_cols":4,"rows_kept":27,"cut":false,"hidden":false,"merged":[[24,1,25,1],[1,1,3,3],[0,2,0,3],[5,1,18,1]]}
[null,null,"Dirección Nacional de Planificación de \nTransporte de Cargas y Logística"]
[null,"COSFER v3: Modelo de Estimación de Costos Ferroviarios de Carga"]
[]
[]
[]
[null,"El COSFER es una herramienta que permite simular distintos escenarios de operación de transporte ferroviario de cargas. A partir de la determinación de ciertos parámetros básicos, el modelo calcula en forma dinámica los costos asociados, discriminados en tres grupos:\n\n w Costos de Movilidad \n w Costos de Inversión en Infraestructura\n w Costos de Mantenimiento de la Infraestructura\n\nEn la pestaña \"Instrucciones\" se especifican las principales consideraciones, mientras que en \"Ingreso de datos\" se inicia la simulación.\n\n                        ¡¡¡ SE DEBEN HABILITAR LAS MACRO !!!"]
{"$rows_left_out":22}
{"sheet":"Instrucciones","index":1,"n_rows":13,"n_cols":2,"rows_kept":13,"cut":false,"hidden":false,"merged":[]}
[]
[]
[]
[]
[1,"El modelo permite calcular los costos asociados a la operación de transporte ferroviario de carga, discriminando los mismos en:\n w Costos de Movilidad \n w Costos de Inversión en Infraestructura\n w Costos de Mantenimiento de la Infraestructura"]
[{"$f":"1+A5","v":2},"En la pestaña \"INGRESO DE DATOS\", se deben escoger los parámetros de la red, corredor o tramo que se desee costear: Zona geográfica, trocha, longitud de vía, distancia media de transporte, carga anual, participación relativa por grupo de producto, topografía, velocidad de circulación, capacidad portante de la vía, cantidad de obras de arte (ODA), pasos a nivel (PAN), aparatos de vía (ADV), intervención propuesta en la infraestructura (renovación, mejoramiento liviano, semipesado, pesado) y el tipo de mantenimiento. "]
{"$rows_left_out":8}
{"sheet":"Ingreso_de_datos","index":2,"n_rows":89,"n_cols":10,"rows_kept":89,"cut":false,"hidden":false,"merged":[[0,7,1,8],[0,9,1,10],[62,8,64,8],[52,8,58,9],[9,8,11,9],[38,8,41,9],[18,8,22,9],[12,8,14,9],[3,8,3,9]]}
[null,null,null,null,null,null,null,"Periodo",null,"2019-03-01"]
[]
[]
[]
[0,"TROCHA",{"$f":"+IF(A5=1,\"ANCHA\",IF(A5=2,\"ANGOSTA\",IF(A5=3,\"MEDIA\",\"ELEGIR\")))","v":"ELEGIR"}]
[null,"LONGITUD DE VIA",0,"Km."]
{"$rows_left_out":84}
{"sheet":"ParaGraficos","index":3,"n_rows":236,"n_cols":32,"rows_kept":236,"cut":false,"hidden":true,"merged":[[21,1,21,7],[0,0,9,1],[57,1,57,7],[93,1,93,7],[139,1,139,7],[135,0,135,1],[134,0,134,1],[133,0,133,1],[132,0,132,1],[134,2,134,3],[134,4,134,5]]}
["NO MODIFICAR NADA DE ESTA PESTAÑA !!!!!! \nPORQUE DEJAN DE FUNCIONAR LAS MACRO",null,null,null,null,null,null,null,null,null,null,null,null,null,null,null,null,null,null,null,null,"NCA","FEPSA","FERROSUR","BELGRANO","SAN MARTIN","URQUIZA","OTRO",null,null,0.05,"Tasa de descuento"]
[null,null,{"$f":"+RANK(E2,$E$2:$E$18,0)","v":{"$error":"#DIV/0!"}},{"$f":"+Movilidad!C6","v":"COMBUSTIBLE"},{"$f":"+Movilidad!G6","v":{"$error":"#DIV/0!"}},1,{"$f":"+VLOOKUP(F2,$C$2:$E$18,2,FALSE)","v":{"$error":"#N/A"}},{"$f":"+IFERROR(VLOOKUP(F2,$C$2:$E$18,3,FALSE),0)","v":0},null,null,{"$f":"+Mantenimiento!$I$14","v":0},{"$f":"+Mantenimiento!$I$15","v":0},{"$f":"+Mantenimiento!$I$16","v":0},{"$f":"+Mantenimiento!$I$17","v":0},null,null,null,null,null,null,"TROCHA",1,1,1,2,1,3,0,null,null,15.829599999999999,"Tipo de cambio"]
[null,null,{"$error":"#DIV/0!"},{"$f":"+Movilidad!C7","v":"LUBRICANTES"},{"$f":"+Movilidad!G7","v":{"$error":"#DIV/0!"}},2,{"$error":"#N/A"},0,null,"Personal",{"$f":"+Mantenimiento!D30","v":{"$error":"#DIV/0!"}},{"$f":"+Mantenimiento!D46","v":{"$error":"#DIV/0!"}},{"$f":"+Mantenimiento!D74+((SUM(Mantenimiento!B65:D65)/Mantenimiento!I61)+(SUM(Mantenimiento!E65)/Mantenimiento!I62)+(SUM(Mantenimiento!F65)/Mantenimiento!I63))*Mantenimiento!I77","v":{"$error":"#DIV/0!"}},{"$f":"+Mantenimiento!D109+((SUM(Mantenimiento!B100:D100)/Mantenimiento!I96)+(SUM(Mantenimiento!E100)/Mantenimiento!I97)+(SUM(Mantenimiento!F100)/Mantenimiento!I98))*Mantenimiento!I110","v":{"$error":"#DIV/0!"}},{"$f":"SUM(K3:N3)","v":{"$error":"#DIV/0!"}},null,null,null,null,null,"LONGITUD DE VIA",3203,2817,2907.0729999999999,4897,2655,1486,0,null,null,6.0000000000000001E-3,"Impuesto a los créditos"]
[null,null,{"$error":"#DIV/0!"},{"$f":"+Movilidad!C8","v":"REPARACION Y MANTENIMIENTO DEL MATERIAL RODANTE"},{"$f":"+Movilidad!G8","v":{"$error":"#DIV/0!"}},3,{"$error":"#N/A"},0,null,"Vehículos y Máquinas",{"$f":"+Mantenimiento!D33","v":{"$error":"#DIV/0!"}},null,{"$f":"+((SUM(Mantenimiento!B62:D64)/Mantenimiento!I61)+(SUM(Mantenimiento!E62:E64)/Mantenimiento!I62)+(SUM(Mantenimiento!F62:F64)/Mantenimiento!I63))*Mantenimiento!I77+Mantenimiento!D79","v":{"$error":"#DIV/0!"}},{"$f":"+((SUM(Mantenimiento!B97:D99)/Mantenimiento!I96)+(SUM(Mantenimiento!E97:E99)/Mantenimiento!I97)+(SUM(Mantenimiento!F97:F99)/Mantenimiento!I98))*Mantenimiento!I110+Mantenimiento!D114","v":{"$error":"#DIV/0!"}},{"$f":"SUM(K4:N4)","v":{"$error":"#DIV/0!"}},null,null,null,null,null,"DISTANCIA MEDIA DE VIAJE",429.69202109892927,416.55288643497636,368.8562695335055,786.43743331793246,660.77423006577897,620.73732624046102,0,null,null,6.0000000000000001E-3,"Impuesto a los débitos"]
[null,null,{"$error":"#DIV/0!"},{"$f":"+Movilidad!C11","v":"CAE Material Rodante"},{"$f":"+Movilidad!G11","v":{"$error":"#DIV/0!"}},4,{"$error":"#N/A"},0,null,"Materiales",{"$f":"+Mantenimiento!D40","v":{"$error":"#DIV/0!"}},{"$f":"+SUM(Mantenimiento!D48:D53)","v":{"$error":"#DIV/0!"}},{"$f":"+Mantenimiento!D87","v":{"$error":"#DIV/0!"}},{"$f":"+Mantenimiento!D119","v":{"$error":"#DIV/0!"}},{"$f":"SUM(K5:N5)","v":{"$error":"#DIV/0!"}},null,null,null,null,null,"ZONA",1,1,1,2,4,3,0,null,null,1.4999999999999999E-2,"Impuesto a los IIBB"]
[null,null,{"$error":"#DIV/0!"},{"$f":"+Movilidad!C14","v":"SALARIOS DEL PERSONAL"},{"$f":"+Movilidad!G14","v":{"$error":"#DIV/0!"}},5,{"$error":"#N/A"},0,null,null,{"$f":"SUM(K3:K5)","v":{"$error":"#DIV/0!"}},{"$f":"SUM(L3:L5)","v":{"$error":"#DIV/0!"}},{"$f":"SUM(M3:M5)","v":{"$error":"#DIV/0!"}},{"$f":"SUM(N3:N5)","v":{"$error":"#DIV/0!"}},{"$f":"SUM(K6:N6)","v":{"$error":"#DIV/0!"}},null,null,null,{"$f":"+NOW()","v":"2019-06-19T12:47:18.770"},null,"TOPOGRAFIA DE LA TRAZA",null,null,null,null,null,null,null,null,null,0.66,"Valuación fiscal / valuación venal (%)"]
{"$rows_left_out":231}
{"sheet":"Resultados","index":4,"n_rows":116,"n_cols":17,"rows_kept":116,"cut":false,"hidden":false,"merged":[[80,8,80,11],[80,13,80,16],[81,8,82,8],[81,9,81,11],[81,13,82,13],[81,14,81,16],[61,8,62,8],[61,9,61,11],[40,13,40,16],[41,13,42,13],[41,14,41,16],[60,13,60,16],[61,13,62,13],[61,14,61,16],[5,1,5,3],[40,8,40,11],[41,8,42,8],[41,9,41,11],[60,8,60,11],[9,5,9,10],[5,5,5,10],[101,14,101,16],[101,13,102,13],[101,9,101,11],[101,8,102,8],[100,13,100,16],[100,8,100,11]]}
[]
[]
[]
[]
[]
[null,"Costo por ton-km en centavos de u$s",null,null,null,"CARACTERÍSTICAS PRINCIPALES"]
{"$rows_left_out":111}
{"sheet":"Registro","index":5,"n_rows":110,"n_cols":2,"rows_kept":110,"cut":false,"hidden":false,"merged":[]}
[]
[]
[]
[]
[]
["Fecha y hora del cálculo"]
{"$rows_left_out":105}
{"sheet":"Parametros","index":6,"n_rows":240,"n_cols":12,"rows_kept":240,"cut":false,"hidden":false,"merged":[[34,7,48,7],[207,7,214,7],[4,1,16,1],[59,7,62,7],[17,1,25,1],[26,1,33,1],[34,1,66,1],[54,7,58,7],[23,7,25,7],[140,7,142,7],[169,7,182,7],[67,1,134,1],[203,1,239,1],[217,7,221,7],[215,7,216,7],[233,7,239,7],[223,7,227,7],[158,1,202,1],[193,7,202,7],[87,7,94,7],[140,1,157,1],[135,1,139,1],[112,7,116,7],[95,7,110,7]]}
[null,null,null,null,null,null,null,null,null,null,"Si","No"]
[]
[]
[null,"RUBRO","CONCEPTO","UNIDAD","VALOR UTILIZADO","VALOR BASE O INGRESO MANUAL","ACTUALIZA?","OBSERVACIONES"]
[null,"VARIOS","Tasa de descuento","%",{"$f":"+F5","v":0.05},0.05,null,null,null,null,{"$f":"+IF(G5=\"Si\",0,1)","v":1}]
[null,null,"Tipo de cambio","$/U$D",{"$f":"+IF(G6=\"Si\",L6,F6)","v":41.362400000000001},15.829599999999999,"Si","Cotización promedio mensual del BCRA – Comunicación “A” 3500.",null,null,{"$f":"+IF(G6=\"Si\",0,1)","v":0},{"$f":"+HLOOKUP(Ingreso_de_datos!$J$1,'Actualización de parámetros'!B1:AF78,'Actualización de parámetros'!A3,FALSE)","v":41.362400000000001}]
{"$rows_left_out":235}
{"sheet":"Actualización de parámetros","index":7,"n_rows":85,"n_cols":34,"rows_kept":85,"cut":false,"hidden":true,"merged":[[11,2,22,2],[8,2,10,2],[69,2,70,2],[71,2,73,2],[64,2,68,2],[37,2,39,2],[54,2,57,2],[44,2,53,2],[58,2,61,2],[62,2,63,2]]}
[1,"Ítem","Fuente","Aportes patronales","2016-12-01","2017-01-01","2017-02-01","2017-03-01","2017-04-01","2017-05-01","2017-06-01","2017-07-01","2017-08-01","2017-09-01","2017-10-01","2017-11-01","2017-12-01","2018-01-01","2018-02-01","2018-03-01","2018-04-01","2018-05-01","2018-06-01","2018-07-01","2018-08-01","2018-09-01","2018-10-01","2018-11-01","2018-12-01","2019-01-01","2019-02-01","2019-03-01","2019-04-01"]
[{"$f":"1+A1","v":2},"Índice de salarios de la cons","https://www.estadisticaciudad.gob.ar/eyc/?p=27207",null,100,103.03053423808058,103.03053423808058,103.03053423808058,114.00380300572689,114.00380300572689,114.00380300572689,125.87584177090187,125.87584177090187,125.87584177090187,125.87584177090187,125.87584177090187,125.87584177090187,127.91111264413031,129.81358589659695,131.26196732772146,144.38816406049361,144.38816406049361,144.38816406049361,144.85383867180508,152.07570821769826,158.14219446414822,158.14219446414822,167.6024381716193,176.57725795325868,177.16403110946555,177.16403110946555,181.86657823271511]
[{"$f":"1+A2","v":3},"Tipo de cambio","BCRA - Comunicación \"A\" 3500 ",null,15.829599999999999,15.906499999999996,15.5983,15.5237,15.6,15.6981,16.116599999999998,17.169,17.416499999999999,17.246500000000001,17.4528,17.4925,17.700052631578945,19.029,19.840900000000001,20.237800000000004,20.2349,23.668700000000001,26.534199999999998,27.624700000000001,30.124500000000001,38.590000000000003,37.120199999999997,36.459036842105263,37.885199999999998,37.4069,38.4086,41.362400000000001]
[4,"Precio del gasoil ($/lt) ","http://res1104.se.gob.ar/consultaprecios.mayo.php",null,14.016299999999999,14.74,15.067299999999999,15.045299999999999,14.8035,14.7241,14.8314,15.416399999999999,15.626099999999999,15.700799999999999,16.196000000000002,16.961200000000002,17.148099999999999,17.882000000000001,18.758199999999999,18.289100000000001,18.393999999999998,18.710699999999999,20.892900000000001,22.090900000000001,24.817399999999999,29.010200000000001,31.153099999999998,33.183300000000003,33.858600000000003,33.366900000000001,35.064,34.768999999999998]
[5,"Precio del lubricante ($/lt) ","proporción del precio del gas oil",null,{"$f":"+E4*2.6557","v":37.223087909999997},{"$f":"+F4*2.6557","v":39.145018},40.014228609999996,39.955803209999999,39.31365495,39.102792369999996,39.387748979999998,40.941333479999997,41.498233769999999,41.69661456,43.0117172,45.043858840000006,45.540209169999997,47.489227400000004,49.816151739999995,48.570362870000004,48.848945799999996,49.690005989999996,55.485274529999998,58.666803130000005,65.907569179999996,77.04238814,82.733287669999996,88.124889809999999,89.918284020000002,88.612476330000007,93.119464800000003,92.336033299999997]
[6,"Índice del costo de la construcción (ICC-INDEC)","https://www.indec.gob.ar/nivel4_default.asp?id_tema_1=3&id_tema_2=5&id_tema_3=33",null,1,2.6661493265340175,1.689882302127188,1.0777807273692597,5.5310431768042845,1.1497685530834856,1.0530459600432973,5.9310479158551033,1.2641353314333026,0.79440737210041412,0.75662042875155322,0.4425174325049186,1.4463085754973015,1.1142305667660946,2.394793926247285,1.5930853317515536,5.70940028359328,2.8208466485185602,2.4787046274269198,1.7260745843941772,3.728514115352044,7.4905968348591534,2.2315386392895986,3.5390228938616097,3.3182597848121054,1.0896797367865085,1.4063899671543645,2.6]
{"$rows_left_out":80}
{"sheet":"Movilidad","index":8,"n_rows":39,"n_cols":7,"rows_kept":39,"cut":false,"hidden":false,"merged":[[3,3,3,4],[3,5,3,6],[3,1,4,2]]}
[]
[]
[]
[null,"RUBROS",null,"En pesos",null,"En USD "]
[null,null,null,"por ton-km","%","por ton-km","%"]
[null,1,"COMBUSTIBLE",{"$f":"+((SUMPRODUCT(Ingreso_de_datos!$C$80:$C$82,Parametros!$L$27:$L$29)/Ingreso_de_datos!$C$6)*Parametros!$E$33*Recursos!$B$30)/Recursos!$B$9","v":{"$error":"#DIV/0!"}},{"$f":"+Movilidad!D6/$D$39","v":{"$error":"#DIV/0!"}},{"$f":"+Movilidad!D6/Parametros!$E$6","v":{"$error":"#DIV/0!"}},{"$f":"+F6/$F$39","v":{"$error":"#DIV/0!"}}]
{"$rows_left_out":34}
{"sheet":"Recursos","index":9,"n_rows":61,"n_cols":9,"rows_kept":61,"cut":false,"hidden":false,"merged":[[15,3,17,5]]}
[]
[]
[]
["CONCEPTO","VALOR","UNIDAD"]
["Carga total",{"$f":"+B9/B8","v":{"$error":"#DIV/0!"}},"ton"]
["Carga en sentido A",{"$f":"+B5/(1+Ingreso_de_datos!$C$16/100)","v":{"$error":"#DIV/0!"}},"ton"]
{"$rows_left_out":56}
{"sheet":"MatRod","index":10,"n_rows":87,"n_cols":10,"rows_kept":87,"cut":false,"hidden":false,"merged":[[54,0,54,7],[66,4,71,4],[66,5,71,5],[82,2,86,2],[3,9,9,9],[13,9,18,9],[43,4,48,4],[43,5,48,5],[28,0,28,7]]}
[]
[]
[]
["LOCOMOTORAS",{"$f":"+Parametros!H72","v":"Locomotora GT-22 CW Remanufacturada - 2500 HP - Motor EMD-12-645E3"},{"$f":"+Parametros!H73","v":"Locomotora GT-23 CW Remanufacturada - 2200 HP - Motor EMD-16-645E"},{"$f":"+Parametros!H74","v":"Locomotora GT-22 C3 Nueva - 2500 HP - Motor 12-645E3"},{"$f":"+Parametros!H75","v":"Locomotora NVIROMOTIVE 3GS24CW - 2400 HP - Motor Cummins QSK19"},{"$f":"+Parametros!H76","v":"Locomotora NVIROMOTIVE 2GS16CW - 1600 HP - Motor Cummins QSK19"},{"$f":"+Parametros!H77","v":"Locomotora Remanufacturada 1500 HP - Motor EMD 12-645E "},{"$f":"+Parametros!H78","v":"Locomotora GP-9 - 1750 HP - Motor EMD 16-567C"},{"$f":"+Parametros!H79","v":"Locomotora GP40-2 - 3000 HP - Motor EMD 16-645E3 B"},"TOTAL LOCOMOTORAS"]
["Origen","Croacia","Croacia","USA","USA","USA","Mexico","Mexico","Mexico"]
["Valor u$s",{"$f":"+Parametros!E72","v":1975000},{"$f":"+Parametros!E73","v":1550000},{"$f":"+Parametros!E74","v":2750000},{"$f":"+Parametros!E75","v":2750000},{"$f":"+Parametros!E76","v":2450000},{"$f":"+Parametros!E77","v":960000},{"$f":"+Parametros!E78","v":540000},{"$f":"+Parametros!E79","v":660000}]
{"$rows_left_out":82}
{"sheet":"Mantenimiento","index":11,"n_rows":122,"n_cols":10,"rows_kept":122,"cut":false,"hidden":false,"merged":[[120,0,120,2],[121,0,121,2],[10,3,12,3],[13,3,15,3],[88,0,88,2],[89,0,89,2],[23,0,23,3],[43,0,43,3],[53,0,53,2],[54,0,54,2],[40,0,40,2],[41,0,41,2],[56,0,56,5],[104,4,107,5],[102,0,102,3],[67,0,67,3],[17,7,20,7],[10,2,12,2],[13,2,15,2],[23,7,23,8],[43,7,43,8],[25,4,28,5],[69,4,72,5],[111,4,112,4],[76,4,77,4],[30,4,31,4],[45,4,46,6],[91,0,91,5]]}
[]
[]
[]
["Toneladas Ficticias",{"$f":"+(B5*B7)/(18*IF(Ingreso_de_datos!C5=\"angosta\",Mantenimiento!B9,Mantenimiento!B8))","v":{"$error":"#DIV/0!"}}]
["Toneladas brutas remolcadas diarias",{"$f":"+(Recursos!B5/365)*Mantenimiento!B6","v":{"$error":"#DIV/0!"}}]
["Relación peso bruto / neto",1.5]
{"$rows_left_out":117}
{"sheet":"Infraestructura","index":12,"n_rows":76,"n_cols":12,"rows_kept":76,"cut":false,"hidden":false,"merged":[[44,4,45,4],[23,1,23,4],[11,9,15,9],[23,5,24,5],[19,0,20,0],[19,1,19,4],[42,4,43,4]]}
[]
[]
[]
[null,"Renovación","Mejoramiento Liviano","Mejoramiento Semi Pesado","Mejoramiento Pesado","Mejoramiento definido por el Usuario","TOTAL",null,"Mejoramiento Liviano","Mejoramiento Semi Pesado","Mejoramiento Pesado","Mejoramiento definido por el Usuario"]
["$ sin IVA",{"$f":"+B7*Parametros!$E$6","v":{"$error":"#N/A"}},0,0,0,0,{"$f":"SUM(B5:F5)","v":{"$error":"#N/A"}},null,{"$f":"+Mejoramiento!H15*Ingreso_de_datos!$C$20*Ingreso_de_datos!$C$6/100","v":0},{"$f":"+Mejoramiento!H15*Ingreso_de_datos!$C$21*Ingreso_de_datos!$C$6/100","v":0},{"$f":"+Mejoramiento!H15*Ingreso_de_datos!$C$22*Ingreso_de_datos!$C$6/100","v":0},{"$f":"+Mejoramiento!H15*Ingreso_de_datos!$C$23*Ingreso_de_datos!$C$6/100","v":0}]
["$ con IVA",{"$f":"+B8*Parametros!$E$6","v":{"$error":"#N/A"}},0,0,0,0,{"$f":"SUM(B6:F6)","v":{"$error":"#N/A"}},null,{"$f":"Mejoramiento!H16*Ingreso_de_datos!$C$20*Ingreso_de_datos!$C$6/100","v":0},{"$f":"Mejoramiento!H16*Ingreso_de_datos!$C$21*Ingreso_de_datos!$C$6/100","v":0},{"$f":"Mejoramiento!H16*Ingreso_de_datos!$C$22*Ingreso_de_datos!$C$6/100","v":0},{"$f":"+Mejoramiento!H16*Ingreso_de_datos!$C$23*Ingreso_de_datos!$C$6/100","v":0}]
{"$rows_left_out":71}
{"sheet":"Renovacion","index":13,"n_rows":52,"n_cols":16,"rows_kept":52,"cut":false,"hidden":false,"merged":[[32,0,32,3],[33,0,33,3],[45,0,45,3],[34,0,34,3],[35,0,35,3],[36,0,36,3],[37,0,37,3],[38,0,38,3],[39,0,39,3],[40,0,40,3],[41,0,41,3],[42,0,42,3],[43,0,43,3],[44,0,44,3]]}
[]
[]
[]
["Zona","Indicador de columnas para buscar monto","Provincias","Distancia media de transporte de durmientes desde bs as","Costo medio zonal del transporte terrestre del durmiente de angosta (Ton-Km =)","Costo medio zonal del transporte  terrestre de durmientes de media y ancha(Ton-Km =)","Distancia media de transporte de balasto desde cantera mas cercana","Costo medio zonal del transporte terrestre de la tonelada de piedra","Distancia media de transporte de rieles desde puerto mas cercano","Costo medio zonal del transporte terrestre del Km lineal de riel 54E1","Adicional por mano de obra","incidencia de la m.o en el costo total de acuerdo a la zona trocha ancha","incidencia de la m.o en el costo total de acuerdo a la zona trocha angosta",null,"incidencia del transporte en general de acuerdo a zona en trocha ancha","incidencia del transporte en general de acuerdo a zona en trocha Angosta"]
["Centro",2,"CABA, Santa Fe, Buenos Aires, Córdoba y La Pampa",400,{"$f":"$D$12*D5*0.25","v":88},{"$f":"$D$12*D5*0.32","v":112.64},300,{"$f":"G5*$D$12","v":264},400,{"$f":"I5*54*$D$12","v":19008},1,{"$f":"(0.2066*K5)+1-0.2066","v":0.99999999999999989},{"$f":"(0.2037*K5)+1-0.2037","v":1},null,{"$f":"(0.229632*(G5/$G$5))+(0.02973139*(I5/$I$5))+(0.07307961*(D5/$D$5))+1-0.332443","v":1},{"$f":"(0.17577*(G5/$G$6))+(0.008675*(I5/$I$6))+(0.026755*(D5/$D$6))+1-0.2112","v":0.94897150000000008}]
["Norte",3,"Sgo del Estero, Catamarca, Jujuy, Formosa, La Rioja, Salta, Tucumán y Chaco.",500,110,140.80000000000001,400,352,500,23760,1,{"$f":"(0.2066*K6)+1-0.2066","v":0.99999999999999989},1,null,1.1022467499999999,1]
{"$rows_left_out":47}
{"sheet":"Mejoramiento","index":14,"n_rows":17,"n_cols":30,"rows_kept":17,"cut":false,"hidden":false,"merged":[[15,2,15,3],[9,17,9,18],[10,17,10,18],[11,17,11,18],[12,17,12,18],[13,17,13,18],[14,2,14,3],[8,17,8,18],[4,17,4,18],[5,17,5,18],[6,17,6,18],[7,17,7,18]]}
[null,null,null,null,null,null,null,null,null,null,null,null,null,null,null,null,null,null,null,null,null,null,null,null,null,null,null,null,12,36]
[]
[]
["DENOMINACIÓN DE LOS TRABAJOS","UM","Cantidad","C.U.","C.T.",null,"C.T. con obrador","P.T sin IVA","Mano de Obra","Insumos Importados","Insumos Nacionales","Parámetro","Fijo","Variable","Fijo","Variable",null,"Panel de control",null,"Mejoramiento liviano","Unidad",null,null,null,null,"Mejoramiento pesado","Mejoramiento liviano","Mejoramiento semi-pesado","A Definir"]
["Relevamiento, Proyecto Ejecutivo y Replanteo + Conducción","gl",1,{"$f":"+L5","v":2179109.565712749},{"$f":"+C5*D5","v":2179109.565712749},{"$f":"+E5/$E$15","v":3.4022057918703268E-3},{"$f":"+E5+F5*$E$14","v":2192894.1666803113},{"$f":"+G5*$E$16","v":2938478.1833516173},0.79,0.11,0.1,{"$f":"+Parametros!E184","v":2179109.565712749},null,null,null,null,null,"Cantidad de kilómetros",null,100,"km",2,null,null,"Cantidad de kilómetros",100,100,100,100]
["Limpieza de zona de vía - desmalezado","mlv",{"$f":"1000*T5","v":100000},{"$f":"+L6","v":49.887975460773617},{"$f":"+C6*D6","v":4988797.5460773613},{"$f":"+E6/$E$15","v":7.7889226741021276E-3},{"$f":"+E6+F6*$E$14","v":5020355.6579606142},6727276.581667223,0.88,0.08,0.04,{"$f":"+Parametros!E185","v":49.887975460773617},null,null,null,null,null,"Durmientes por kilómetro existente",null,1772,"durm/km",{"$f":"1+V5","v":3},null,null,"Durmientes por kilómetro existente",1722,1722,1722,{"$f":"+Parametros!E194","v":1772}]
{"$rows_left_out":11}